Skip to content

fix: visor dash styling #222

fix: visor dash styling

fix: visor dash styling #222

Triggered via pull request September 14, 2026 11:17
Status Failure
Total duration 4m 6s
Artifacts 4

python-tests.yml

on: pull_request
Matrix: test
Fit to window
Zoom out
Zoom in

Annotations

18 errors and 4 warnings
test (3.14)
Process completed with exit code 1.
test (3.14)
Test FAILURES detected.
test (3.14)
Process completed with exit code 1.
test (3.14)
Process completed with exit code 1.
test (3.13)
The strategy configuration was canceled because "test._3_14" failed
test (3.13)
Process completed with exit code 3.
test (3.13)
Both test FAILURES and ERRORS detected.
test (3.13)
The operation was canceled.
test (3.13)
Process completed with exit code 1.
test (3.11)
The strategy configuration was canceled because "test._3_14" failed
test (3.11)
Process completed with exit code 3.
test (3.11)
Both test FAILURES and ERRORS detected.
test (3.11)
The operation was canceled.
test (3.11)
Process completed with exit code 1.
test (3.12)
The strategy configuration was canceled because "test._3_14" failed
test (3.12)
Process completed with exit code 2.
test (3.12)
Test ERRORS detected (infrastructure/runtime issues).
test (3.12)
The operation was canceled.
test (3.14)
Node.js 20 is deprecated. The following actions target Node.js 20 but are being forced to run on Node.js 24: actions/checkout@v4, actions/setup-python@v5, actions/upload-artifact@v4. For more information see: https://github.blog/changelog/2025-09-19-deprecation-of-node-20-on-github-actions-runners/
test (3.13)
Node.js 20 is deprecated. The following actions target Node.js 20 but are being forced to run on Node.js 24: actions/checkout@v4, actions/setup-python@v5, actions/upload-artifact@v4. For more information see: https://github.blog/changelog/2025-09-19-deprecation-of-node-20-on-github-actions-runners/
test (3.11)
Node.js 20 is deprecated. The following actions target Node.js 20 but are being forced to run on Node.js 24: actions/checkout@v4, actions/setup-python@v5, actions/upload-artifact@v4. For more information see: https://github.blog/changelog/2025-09-19-deprecation-of-node-20-on-github-actions-runners/
test (3.12)
Node.js 20 is deprecated. The following actions target Node.js 20 but are being forced to run on Node.js 24: actions/checkout@v4, actions/setup-python@v5, actions/upload-artifact@v4. For more information see: https://github.blog/changelog/2025-09-19-deprecation-of-node-20-on-github-actions-runners/

Artifacts

Produced during runtime
Name Size Digest
test-logs-test-py3.11
2.2 MB
sha256:feb18c0caf085a017c32c9909dea1bcbf240b7267aef854fd8da4d16d78dca29
test-logs-test-py3.12
927 KB
sha256:bc0af2a961d2b785bb749997e72d666e66c77be88d261f3bc5a8596d2ade5128
test-logs-test-py3.13
2.21 MB
sha256:fe6c0acb11a01092748742f80f020c19c19203f0bd216757f050187f5e2fd2d7
test-logs-test-py3.14
2.24 MB
sha256:453769777887b665bb7ad824750612b9fbde5870e345b5b4b8b91c47bfb74f5a