Skip to content

feat: [Remote rendering 3.2a] server-tracked camera: record, load-path write, and re-serialization #227

feat: [Remote rendering 3.2a] server-tracked camera: record, load-path write, and re-serialization

feat: [Remote rendering 3.2a] server-tracked camera: record, load-path write, and re-serialization #227

Triggered via pull request September 14, 2026 18:00
Status Failure
Total duration 11m 9s
Artifacts 4

python-tests.yml

on: pull_request
Matrix: test
Fit to window
Zoom out
Zoom in

Annotations

15 errors and 4 warnings
test (3.12)
Process completed with exit code 3.
test (3.12)
Both test FAILURES and ERRORS detected.
test (3.12)
Process completed with exit code 1.
test (3.11)
The strategy configuration was canceled because "test._3_12" failed
test (3.11)
Process completed with exit code 1.
test (3.11)
Test FAILURES detected.
test (3.11)
Process completed with exit code 1.
test (3.14)
The strategy configuration was canceled because "test._3_12" failed
test (3.14)
Process completed with exit code 1.
test (3.14)
Test FAILURES detected.
test (3.14)
Process completed with exit code 1.
test (3.13)
The strategy configuration was canceled because "test._3_12" failed
test (3.13)
Process completed with exit code 1.
test (3.13)
Test FAILURES detected.
test (3.13)
Process completed with exit code 1.
test (3.12)
Node.js 20 is deprecated. The following actions target Node.js 20 but are being forced to run on Node.js 24: actions/checkout@v4, actions/setup-python@v5, actions/upload-artifact@v4. For more information see: https://github.blog/changelog/2025-09-19-deprecation-of-node-20-on-github-actions-runners/
test (3.11)
Node.js 20 is deprecated. The following actions target Node.js 20 but are being forced to run on Node.js 24: actions/checkout@v4, actions/setup-python@v5, actions/upload-artifact@v4. For more information see: https://github.blog/changelog/2025-09-19-deprecation-of-node-20-on-github-actions-runners/
test (3.14)
Node.js 20 is deprecated. The following actions target Node.js 20 but are being forced to run on Node.js 24: actions/checkout@v4, actions/setup-python@v5, actions/upload-artifact@v4. For more information see: https://github.blog/changelog/2025-09-19-deprecation-of-node-20-on-github-actions-runners/
test (3.13)
Node.js 20 is deprecated. The following actions target Node.js 20 but are being forced to run on Node.js 24: actions/checkout@v4, actions/setup-python@v5, actions/upload-artifact@v4. For more information see: https://github.blog/changelog/2025-09-19-deprecation-of-node-20-on-github-actions-runners/

Artifacts

Produced during runtime
Name Size Digest
test-logs-test-py3.11
1.79 MB
sha256:71533927f15c69fa95358652a48c05e2a164bb2f68eeed3899f1a6aee056c247
test-logs-test-py3.12
1.5 MB
sha256:0cceb81d153966539f7279149c7a377f08c71ab294dac145bb7be6b9bae883fb
test-logs-test-py3.13
1.78 MB
sha256:45f9234ae3e720ca5813db73a7808ceefedeaf53702a24a2a1286f61f16e3c8d
test-logs-test-py3.14
1.53 MB
sha256:fb3781594c53434484c8afe5f3315cf72f695d0f2e41689fe7e45dacf2d533b5